Sample mass
definition: 1. Total mass of sample used. (Mass Spectrometry). 2. The minimum mass of sample collected needs to be sufficient to meet the requirements of sampling precision for analytes of concern (ScienceDirect, 2023, The Coal Handbook (Second Edition) Wes B. Membrey)
broader: Sample description
type: Concept

Sample description
type: Concept
narrower: Sample mass