Magnetic clamp
definition: 1. Magnetic clamping technology enables lightning-fast workpiece clamping without deformation. (https://spreitzer.de/en/clamping-technology/magnetic-clamping-technology/)
broader: Clamp
type: Concept

Clamp
type: Concept
narrower: Magnetic clamp