Freeze
definition: 1. The act or event which causes the transition from a liquid to solid matter phase when the temperature is lowered. (Ontobee, NCI Thesaurus OBO Edition). 2. To become congealed into ice by cold (Merriam-Webster). 3. To become hardened into ice or into a solid body; change from the liquid to the solid state by loss of heat. (dictionary.com)
broader: Physical treatment method
type: Concept

Physical treatment method
type: Concept
narrower: Freeze