Electron beam deposition
definition: A synthesis method where an electron beam is used to decompose gaseous molecules leading to deposition of a solid on a nearby substrate. (Ontobee, Chemical Methods Ontology)
broader: Deposition coating
type: Concept

Deposition coating
type: Concept
narrower: Electron beam deposition