Doping
definition: Doping is the intentional introduction of a small amount of impurity atoms into a material, typically a semiconductor or crystalline solid, to alter its electrical, optical, or structural properties in a controlled manner. (Wikipedia)
broader: Fabrication/Processing/Synthesis
type: Concept

Fabrication/Processing/Synthesis
type: Concept
narrower: Doping