Ceramic
definition: Inorganic, nonmetallic solid prepared by the action of heat and subsequent cooling. (http://www.semanticweb.org/osnathakimi/ontologies/deb#Ceramic)
broader: Material type
type: Concept

Material type
type: Concept
narrower: Ceramic