Back side
definition: The side or surface opposite the front or face of something : the farthest or reverse side. (Merriam-Webster dictionary)
broader: Sample ID position
type: Concept

Sample ID position
type: Concept
narrower: Back side