Deformed
type: Concept
narrower: Rolled

Rolled
type: Concept
broader: Deformed
definition: Rolling is a metal forming process in which metal stock is passed through one or more pairs of rolls to reduce the thickness, to make the thickness uniform, and/or to impart a desired mechanical property. (Wikipedia)