Fabrication/Processing/Synthesis
type: Concept
narrower: Powder Processing

Powder Processing
type: Concept
broader: Fabrication/Processing/Synthesis
definition: Powder processing is a term that refers to the industrial sintering, pressing compression, rolling, and/ or extrusion of powders (https://nelhydrogen.com/glossary/powder-processing/).