Matrix
type: Concept
broader: Micro structure feature
definition: 1. The components of the sample other than the analyte. (IUPAC). 2. Those components of a sample that are not measured by an experiment. (Ontobee, Chemical Methods Ontology). 3. A matrix is a constituent of a composite material. (Wikipedia)

Micro structure feature
type: Concept
narrower: Matrix