Discharging
type: Concept
broader: Physical treatment method
definition: to release electrical energy from (something, such as a battery or capacitor) by a discharge. (Merriam-Webster dictionary)

Physical treatment method
type: Concept
narrower: Discharging