Characterization
type: Concept
broader: Sample purpose
definition: Characterization, when used in materials science, refers to the broad and general process by which a material's structure and properties are probed and measured. It is a fundamental process in the field of materials science, without which no scientific understanding of engineering materials could be ascertained. (Wikipedia)

Sample purpose
type: Concept
narrower: Characterization