Additive Manufacturing
type: Concept
broader: Fabrication/Processing/Synthesis
definition: process of joining materials to make parts from 3D model data, usually layer upon layer, as opposed to subtractive manufacturing and formative manufacturing methodologies. (ATOMISTIC_EMMO)

Fabrication/Processing/Synthesis
type: Concept
narrower: Additive Manufacturing